Reaction Details
TargetSerine/threonine-protein kinase/endoribonuclease IRE1
LigandBDBM111039
Substrate/Competitorn/a
Meas. Tech.In Vitro Enzyme Assay
pH7.5±n/a
IC50 8850±n/a nM
Commentsextracted
Citation Patterson, JBLonergan, DGFlynn, GAZeng, QPallai, PV IRE-1α inhibitors US Patent US9241942 Publication Date 1/26/2016
 
Serine/threonine-protein kinase/endoribonuclease IRE1
Name:Serine/threonine-protein kinase/endoribonuclease IRE1
Type:Enzyme
Mol. Mass.:109731.20
Organism:Homo sapiens (Human)
Description:O75460
Residue:977
BDBM111039
NameBDBM111039
Synonyms:US8614253, 3-70 US9963434, Compound 3-70
TypeSmall organic molecule
Emp. Form.C8H8O3
Mol. Mass.152.1473
SMILESCOc1ccc(O)c(C=O)c1