Reaction Details
TargetSerine/threonine-protein kinase/endoribonuclease IRE1
LigandBDBM111263
Substrate/Competitorn/a
Meas. Tech.Cell-Based Assay
EC50 80000±n/a nM
Citation Patterson, JBLonergan, DGFlynn, GAZeng, QPallai, PV IRE-1α inhibitors US Patent US9241942 Publication Date 1/26/2016
 
Serine/threonine-protein kinase/endoribonuclease IRE1
Name:Serine/threonine-protein kinase/endoribonuclease IRE1
Type:Enzyme
Mol. Mass.:109731.20
Organism:Homo sapiens (Human)
Description:O75460
Residue:977
BDBM111263
NameBDBM111263
Synonyms:US8614253, 43-23 | US9241942, 27-23
TypeSmall organic molecule
Emp. Form.C15H10O2S
Mol. Mass.254.304
SMILESOc1ccc(cc1C=O)-c1cc2ccccc2s1