Reaction Details
TargetSerine/threonine-protein kinase/endoribonuclease IRE1
LigandBDBM111341
Substrate/Competitorn/a
Meas. Tech.Cell-Based Assay
EC50 10000±n/a nM
Citation Patterson, JBLonergan, DGFlynn, GAZeng, QPallai, PV IRE-1α inhibitors US Patent US9241942 Publication Date 1/26/2016
 
Serine/threonine-protein kinase/endoribonuclease IRE1
Name:Serine/threonine-protein kinase/endoribonuclease IRE1
Type:Enzyme
Mol. Mass.:109731.20
Organism:Homo sapiens (Human)
Description:O75460
Residue:977
BDBM111341
NameBDBM111341
Synonyms:US8614253, 29-1 | US9241942, 29-1
TypeSmall organic molecule
Emp. Form.C19H14O4
Mol. Mass.306.3121
SMILESCOC(=O)c1cccc(c1)-c1ccc2c(C=O)c(O)ccc2c1