Reaction Details
TargetSerine/threonine-protein kinase/endoribonuclease IRE1
LigandBDBM111348
Substrate/Competitorn/a
Meas. Tech.Cell-Based Assay
EC50 10000±n/a nM
Citation Patterson, JBLonergan, DGFlynn, GAZeng, QPallai, PV IRE-1α inhibitors US Patent US9241942 Publication Date 1/26/2016
 
Serine/threonine-protein kinase/endoribonuclease IRE1
Name:Serine/threonine-protein kinase/endoribonuclease IRE1
Type:Enzyme
Mol. Mass.:109731.20
Organism:Homo sapiens (Human)
Description:O75460
Residue:977
BDBM111348
NameBDBM111348
Synonyms:US8614253, 29-8 | US9241942, 29-8
TypeSmall organic molecule
Emp. Form.C18H14O3
Mol. Mass.278.302
SMILESOCc1ccc(cc1)-c1ccc2c(C=O)c(O)ccc2c1