Reaction Details
TargetSerine/threonine-protein kinase/endoribonuclease IRE1
LigandBDBM111346
Substrate/Competitorn/a
Meas. Tech.Cell-Based Assay
EC50 3000±n/a nM
Citation Patterson, JBLonergan, DGFlynn, GAZeng, QPallai, PV IRE-1α inhibitors US Patent US9241942 Publication Date 1/26/2016
 
Serine/threonine-protein kinase/endoribonuclease IRE1
Name:Serine/threonine-protein kinase/endoribonuclease IRE1
Type:Enzyme
Mol. Mass.:109731.20
Organism:Homo sapiens (Human)
Description:O75460
Residue:977
BDBM111346
NameBDBM111346
Synonyms:US8614253, 29-6 US9241942, 42-4
TypeSmall organic molecule
Emp. Form.C20H17NO3
Mol. Mass.319.3539
SMILESCN(C)C(=O)c1ccc(cc1)-c1ccc2c(C=O)c(O)ccc2c1