Reaction Details
TargetNitric oxide synthase, brain
LigandBDBM202643
Substrate/Competitorn/a
Meas. Tech.Inhibition Assay
Ki 5±n/a nM
Citation Silverman, RBHuang, HJing, Q Thiophene-2-carboximidamide based selective neuronal nitric oxide inhibitors US Patent US9242957 Publication Date 1/26/2016
 
Nitric oxide synthase, brain
Name:Nitric oxide synthase, brain
Type:Enzyme
Mol. Mass.:160570.98
Organism:Rattus norvegicus (rat)
Description:Recombinant nNOS overexpressed in E. coli was used in enzyme assays.
Residue:1429
BDBM202643
NameBDBM202643
Synonyms:US9242957, 7
TypeSmall organic molecule
Emp. Form.C25H25N5S2
Mol. Mass.459.63
SMILESN=C(Nc1cccc(CCNCc2cccc(NC(=N)c3cccs3)c2)c1)c1cccs1