Reaction Details
TargetNitric oxide synthase, endothelial
LigandBDBM202655
Substrate/Competitorn/a
Meas. Tech.Inhibition Assay
Ki 1860±n/a nM
Citation Silverman, RBHuang, HJing, Q Thiophene-2-carboximidamide based selective neuronal nitric oxide inhibitors US Patent US9242957 Publication Date 1/26/2016
 
Nitric oxide synthase, endothelial
Name:Nitric oxide synthase, endothelial
Type:Enzyme
Mol. Mass.:133292.26
Organism:Bos taurus (bovine)
Description:Recombinant eNOS overexpressed in E. coli was used in enzyme assays.
Residue:1205
BDBM202655
NameBDBM202655
Synonyms:US9242957, QJ-III-21
TypeSmall organic molecule
Emp. Form.C23H24FN3O2S
Mol. Mass.425.519
SMILESFc1cccc(CO[C@@H]2CCN[C@H]2COc2cccc(NC(=N)c3cccs3)c2)c1