Reaction Details
TargetSerine/threonine-protein kinase B-raf
LigandBDBM202851
Substrate/Competitorn/a
Meas. Tech.In Vitro Enzyme Assay
pH7.5±n/a
Temperature298.15±n/a K
IC50 0.152±n/a nM
Commentsextracted
Citation Barsanti, PABurger, MLou, YNishiguchi, GPolyakov, VRamurthy, SRico, ASetti, LSmith, ATaft, BTanner, HDiPesa, AYusuff, N Biaryl amide compounds as kinase inhibitors US Patent US9242969 Publication Date 1/26/2016
 
Serine/threonine-protein kinase B-raf
Name:Serine/threonine-protein kinase B-raf
Type:Serine/threonine-protein kinase
Mol. Mass.:84446.00
Organism:Homo sapiens (Human)
Description:P15056
Residue:766
BDBM202851
NameBDBM202851
Synonyms:US10245267, Example 829 US9242969, 204 | US9694016, 829
TypeSmall organic molecule
Emp. Form.C25H21F3N4O2S
Mol. Mass.498.52
SMILESCc1ccc(NC(=O)c2cccc(c2)C(F)(F)F)cc1-c1nc(N2CCOCC2)c2sccc2n1