Reaction Details
TargetRAF proto-oncogene serine/threonine-protein kinase [Y340E,Y341E]
LigandBDBM202682
Substrate/Competitorn/a
Meas. Tech.In Vitro Enzyme Assay
pH7.5±n/a
Temperature298.15±n/a K
IC50 0.11±n/a nM
Commentsextracted
Citation Barsanti, PABurger, MLou, YNishiguchi, GPolyakov, VRamurthy, SRico, ASetti, LSmith, ATaft, BTanner, HDiPesa, AYusuff, N Biaryl amide compounds as kinase inhibitors US Patent US9242969 Publication Date 1/26/2016
 
RAF proto-oncogene serine/threonine-protein kinase [Y340E,Y341E]
Name:RAF proto-oncogene serine/threonine-protein kinase [Y340E,Y341E]
Type:n/a
Mol. Mass.:73012.38
Organism:Homo sapiens (Human)
Description:P04049[Y340E,Y341E]
Residue:648
BDBM202682
NameBDBM202682
Synonyms:US10245267, Example 38 US9242969, 27 | US9694016, 27
TypeSmall organic molecule
Emp. Form.C24H23F3N4O4S
Mol. Mass.520.524
SMILESCc1ccc(NC(=O)c2cccc(c2)C(F)(F)F)cc1-c1cc(nc(n1)S(C)(=O)=O)N1CCOCC1