Reaction Details
TargetRAF proto-oncogene serine/threonine-protein kinase [1-324]
LigandBDBM202696
Substrate/Competitorn/a
Meas. Tech.In Vitro Enzyme Assay
pH7.5±n/a
Temperature298.15±n/a K
IC50 0.137±n/a nM
Commentsextracted
Citation Barsanti, PABurger, MLou, YNishiguchi, GPolyakov, VRamurthy, SRico, ASetti, LSmith, ATaft, BTanner, HDiPesa, AYusuff, N Biaryl amide compounds as kinase inhibitors US Patent US9242969 Publication Date 1/26/2016
 
RAF proto-oncogene serine/threonine-protein kinase [1-324]
Name:RAF proto-oncogene serine/threonine-protein kinase [1-324]
Type:n/a
Mol. Mass.:36996.69
Organism:Homo sapiens (Human)
Description:P04049 (1-324)
Residue:324
BDBM202696
NameBDBM202696
Synonyms:US10245267, Example 43 US9242969, 42 | US9694016, 42
TypeSmall organic molecule
Emp. Form.C26H25F3N4O2
Mol. Mass.482.4975
SMILESCC(=C)c1cc(nc(n1)N1CCOCC1)-c1cc(NC(=O)c2cccc(c2)C(F)(F)F)ccc1C