Reaction Details
TargetRAF proto-oncogene serine/threonine-protein kinase [1-324]
LigandBDBM202717
Substrate/Competitorn/a
Meas. Tech.In Vitro Enzyme Assay
pH7.5±n/a
Temperature298.15±n/a K
IC50 0.508±n/a nM
Commentsextracted
Citation Barsanti, PABurger, MLou, YNishiguchi, GPolyakov, VRamurthy, SRico, ASetti, LSmith, ATaft, BTanner, HDiPesa, AYusuff, N Biaryl amide compounds as kinase inhibitors US Patent US9242969 Publication Date 1/26/2016
 
RAF proto-oncogene serine/threonine-protein kinase [1-324]
Name:RAF proto-oncogene serine/threonine-protein kinase [1-324]
Type:n/a
Mol. Mass.:36996.69
Organism:Homo sapiens (Human)
Description:P04049 (1-324)
Residue:324
BDBM202717
NameBDBM202717
Synonyms:US10245267, Example 63 US9242969, 63 | US9694016, 63
TypeSmall organic molecule
Emp. Form.C24H22F3N3O2
Mol. Mass.441.4456
SMILESCc1ccc(cc1-c1ccnc(c1)N1CCOCC1)C(=O)Nc1cccc(c1)C(F)(F)F