Reaction Details
TargetOrexin receptor type 2
LigandBDBM50447804
Substrate/Competitorn/a
Meas. Tech.In Vitro Assay: Intracellular Calcium Measurements
Temperature310.15±n/a K
IC50 3±n/a nM
Commentsextracted
Citation Aissaoui, HBoss, CBrotschi, CHeidmann, BSifferlen, TWilliams, JT Lactam derivatives useful as orexin receptor antagonists US Patent US9242970 Publication Date 1/26/2016
 
Orexin receptor type 2
Name:Orexin receptor type 2
Type:Protein
Mol. Mass.:50710.53
Organism:Homo sapiens (Human)
Description:O43614
Residue:444
BDBM50447804
NameBDBM50447804
Synonyms:CHEMBL3113752 | US9242970, 57
TypeSmall organic molecule
Emp. Form.C25H24N2O4
Mol. Mass.416.4691
SMILESCOc1ccnc(OC)c1C1CCCC(=O)N1Cc1ccc2oc3ccccc3c2c1