Reaction Details
TargetLarge envelope protein
LigandBDBM289743
Substrate/Competitorn/a
Meas. Tech.HBsAg Assay
Temperature298.15±n/a K
IC50 5.00±n/a nM
Commentsextracted
Citation Han, XJiang, MYang, S 2-oxo-6,7-dihydrobenzo[a]quinolizine-3-carboxylic acid derivatives for the treatment and prophylaxis of hepatitis B virus infection US Patent US10093671 Publication Date 10/9/2018
 
Large envelope protein
Name:Large envelope protein
Type:n/a
Mol. Mass.:42772.52
Organism:Hepatitis B virus
Description:P03138
Residue:389
BDBM289743
NameBDBM289743
Synonyms:US10093671, Example 12
TypeSmall organic molecule
Emp. Form.C26H21NO5S
Mol. Mass.459.514
SMILESCOc1cc-2c(CC(c3cccs3)n3cc(C(O)=O)c(=O)cc-23)cc1OCc1ccccc1