Reaction Details
TargetLarge envelope protein
LigandBDBM289747
Substrate/Competitorn/a
Meas. Tech.HBsAg Assay
Temperature298.15±n/a K
IC50 9.00±n/a nM
Commentsextracted
Citation Han, XJiang, MYang, S 2-oxo-6,7-dihydrobenzo[a]quinolizine-3-carboxylic acid derivatives for the treatment and prophylaxis of hepatitis B virus infection US Patent US10093671 Publication Date 10/9/2018
 
Large envelope protein
Name:Large envelope protein
Type:n/a
Mol. Mass.:42772.52
Organism:Hepatitis B virus
Description:P03138
Residue:389
BDBM289747
NameBDBM289747
Synonyms:US10093671, Example 16
TypeSmall organic molecule
Emp. Form.C25H23N3O5S
Mol. Mass.477.532
SMILESCOc1cc-2c(CC(c3cccs3)n3cc(C(O)=O)c(=O)cc-23)cc1OCCCn1cccn1