Reaction Details
TargetBromodomain testis-specific protein [21-137]
LigandBDBM205429
Substrate/Competitorn/a
Meas. Tech.Bromodomains Assay for DiscoveRx Gene Symbol
Kd 47±0.0 nM
Citation Tanaka, MRoberts, JMSeo, HSSouza, APaulk, JScott, TGDeAngelo, SLDhe-Paganon, SBradner, JE Design and characterization of bivalent BET inhibitors. Nat Chem Biol12:1089-1096 (2016) 
 
Bromodomain testis-specific protein [21-137]
Name:Bromodomain testis-specific protein [21-137]
Type:n/a
Mol. Mass.:13934.55
Organism:Homo sapiens (Human)
Description:Q58F21 (BRDT, 21-137)
Residue:117
BDBM205429
NameBDBM205429
Synonyms: (R)-JQ1 (3) US10925881, Name (R)-JQ1 US11117865, Compound JQ1 US11406645, Compound JQ1 US11890288, Compound (+)-JQ1 | US9320741, (R)-JQ1
TypeSmall organic molecule
Emp. Form.C23H25ClN4O2S
Mol. Mass.456.988
SMILESCc1nnc2[C@@H](CC(=O)OC(C)(C)C)N=C(c3c(C)c(C)sc3-n12)c1ccc(Cl)cc1