Reaction Details
TargetBromodomain-containing protein 2 [348-455]
LigandBDBM205453
Substrate/Competitorn/a
Meas. Tech.Bromodomains Assay for DiscoveRx Gene Symbol
Ki 0.033±0.0 nM
Citation Tanaka, MRoberts, JMSeo, HSSouza, APaulk, JScott, TGDeAngelo, SLDhe-Paganon, SBradner, JE Design and characterization of bivalent BET inhibitors. Nat Chem Biol12:1089-1096 (2016) 
 
Bromodomain-containing protein 2 [348-455]
Name:Bromodomain-containing protein 2 [348-455]
Type:n/a
Mol. Mass.:12751.52
Organism:Homo sapiens (Human)
Description:P25440[348-455]
Residue:108
BDBM205453
NameBDBM205453
Synonyms:MTI (35)
TypeSmall organic molecule
Emp. Form.C54H66Cl2N10O9S2
Mol. Mass.1134.199
SMILESCc1sc-2c(c1C)C(=NC(CC(=O)NCCOCCOCCOCCOCCOCCOCCOCCNC(=O)C[C@@H]1N=C(c3c(C)c(C)sc3-n3c(C)nnc13)c1ccc(Cl)cc1)c1nnc(C)n-21)c1ccc(Cl)cc1