Reaction Details
TargetBromodomain-containing protein 4 [44-168]
LigandBDBM205432
Substrate/Competitorn/a
Meas. Tech.BROMOscan Assay
Kd 0.014±0.0 nM
Citation Tanaka, MRoberts, JMSeo, HSSouza, APaulk, JScott, TGDeAngelo, SLDhe-Paganon, SBradner, JE Design and characterization of bivalent BET inhibitors. Nat Chem Biol12:1089-1096 (2016) 
 
Bromodomain-containing protein 4 [44-168]
Name:Bromodomain-containing protein 4 [44-168]
Type:Enzyme Catalytic Domain
Mol. Mass.:14866.49
Organism:Homo sapiens (Human)
Description:aa (44-168)
Residue:125
BDBM205432
NameBDBM205432
Synonyms:(6S+2S)-PEG2 (8)
TypeSmall organic molecule
Emp. Form.C45H46Cl2N10O6S2
Mol. Mass.957.946
SMILESCOC(=O)C[C@@H]1N=C(c2c(C)c(sc2-n2c(C)nnc12)C(=O)NCCOCCOCCNC(=O)C[C@@H]1N=C(c2c(C)c(C)sc2-n2c(C)nnc12)c1ccc(Cl)cc1)c1ccc(Cl)cc1