Reaction Details
TargetBromodomain-containing protein 4 [333-460]
LigandBDBM205431
Substrate/Competitorn/a
Meas. Tech.BROMOscan Assay
Kd 0.024±0.0 nM
Citation Tanaka, MRoberts, JMSeo, HSSouza, APaulk, JScott, TGDeAngelo, SLDhe-Paganon, SBradner, JE Design and characterization of bivalent BET inhibitors. Nat Chem Biol12:1089-1096 (2016) 
 
Bromodomain-containing protein 4 [333-460]
Name:Bromodomain-containing protein 4 [333-460]
Type:Enzyme Catalytic Domain
Mol. Mass.:14818.38
Organism:Homo sapiens (Human)
Description:aa (333-460)
Residue:128
BDBM205431
NameBDBM205431
Synonyms:(6S+2S)-PEG1 (7)
TypeSmall organic molecule
Emp. Form.C43H42Cl2N10O5S2
Mol. Mass.913.894
SMILESCOC(=O)C[C@@H]1N=C(c2c(C)c(sc2-n2c(C)nnc12)C(=O)NCCOCCNC(=O)C[C@@H]1N=C(c2c(C)c(C)sc2-n2c(C)nnc12)c1ccc(Cl)cc1)c1ccc(Cl)cc1