Reaction Details
TargetIsoform C of Bromodomain-containing protein 4 (Short)
LigandBDBM205431
Substrate/Competitorn/a
Meas. Tech.BROMOscan Assay
Kd 0.013±0.0 nM
Citation Tanaka, MRoberts, JMSeo, HSSouza, APaulk, JScott, TGDeAngelo, SLDhe-Paganon, SBradner, JE Design and characterization of bivalent BET inhibitors. Nat Chem Biol12:1089-1096 (2016) 
 
Isoform C of Bromodomain-containing protein 4 (Short)
Name:Isoform C of Bromodomain-containing protein 4 (Short)
Type:n/a
Mol. Mass.:80477.46
Organism:Homo sapiens (Human)
Description:O60885-2
Residue:722
BDBM205431
NameBDBM205431
Synonyms:(6S+2S)-PEG1 (7)
TypeSmall organic molecule
Emp. Form.C43H42Cl2N10O5S2
Mol. Mass.913.894
SMILESCOC(=O)C[C@@H]1N=C(c2c(C)c(sc2-n2c(C)nnc12)C(=O)NCCOCCNC(=O)C[C@@H]1N=C(c2c(C)c(C)sc2-n2c(C)nnc12)c1ccc(Cl)cc1)c1ccc(Cl)cc1