Reaction Details
TargetBromodomain testis-specific protein [21-137]
LigandBDBM205438
Substrate/Competitorn/a
Meas. Tech.AlphaScreen BRD Binding Assay
pH7.5±n/a
Temperature298.15±n/a K
IC50 10±0.0 nM
Commentsextracted
Citation Tanaka, MRoberts, JMSeo, HSSouza, APaulk, JScott, TGDeAngelo, SLDhe-Paganon, SBradner, JE Design and characterization of bivalent BET inhibitors. Nat Chem Biol12:1089-1096 (2016) 
 
Bromodomain testis-specific protein [21-137]
Name:Bromodomain testis-specific protein [21-137]
Type:n/a
Mol. Mass.:13934.55
Organism:Homo sapiens (Human)
Description:Q58F21 (BRDT, 21-137)
Residue:117
BDBM205438
NameBDBM205438
Synonyms:6S+IBET-PEG2 (19)
TypeSmall organic molecule
Emp. Form.C50H52ClN11O7S
Mol. Mass.986.535
SMILESCOc1cc2c3n([C@H](C)c4ccccn4)c(=O)n(CC(=O)NCCOCCOCCNC(=O)C[C@@H]4N=C(c5c(C)c(C)sc5-n5c(C)nnc45)c4ccc(Cl)cc4)c3cnc2cc1-c1c(C)noc1C