Reaction Details
TargetBromodomain-containing protein 4 [44-168]
LigandBDBM205454
Substrate/Competitorn/a
Meas. Tech.AlphaScreen BRD Binding Assay
pH7.5±n/a
Temperature298.15±n/a K
IC50 5.8±0.0 nM
Commentsextracted
Citation Tanaka, MRoberts, JMSeo, HSSouza, APaulk, JScott, TGDeAngelo, SLDhe-Paganon, SBradner, JE Design and characterization of bivalent BET inhibitors. Nat Chem Biol12:1089-1096 (2016) 
 
Bromodomain-containing protein 4 [44-168]
Name:Bromodomain-containing protein 4 [44-168]
Type:Enzyme Catalytic Domain
Mol. Mass.:14866.49
Organism:Homo sapiens (Human)
Description:aa (44-168)
Residue:125
BDBM205454
NameBDBM205454
Synonyms:2S+IBET-PEG2 (25)
TypeSmall organic molecule
Emp. Form.C51H52ClN11O9S
Mol. Mass.1030.545
SMILESCOC(=O)CC1N=C(c2c(C)c(sc2-n2c(C)nnc12)C(=O)NCCOCCOCCNC(=O)Cn1c2cnc3cc(-c4c(C)noc4C)c(OC)cc3c2n([C@H](C)c2ccccn2)c1=O)c1ccc(Cl)cc1