Reaction Details
TargetIsoform C of Bromodomain-containing protein 4 (Short)
LigandBDBM50380682
Substrate/Competitorn/a
Meas. Tech.AlphaScreen BRD Binding Assay
pH7.5±n/a
Temperature298.15±n/a K
IC50 29.4±0.0 nM
Commentsextracted
Citation Tanaka, MRoberts, JMSeo, HSSouza, APaulk, JScott, TGDeAngelo, SLDhe-Paganon, SBradner, JE Design and characterization of bivalent BET inhibitors. Nat Chem Biol12:1089-1096 (2016) 
 
Isoform C of Bromodomain-containing protein 4 (Short)
Name:Isoform C of Bromodomain-containing protein 4 (Short)
Type:n/a
Mol. Mass.:80477.46
Organism:Homo sapiens (Human)
Description:O60885-2
Residue:722
BDBM50380682
NameBDBM50380682
Synonyms:CHEMBL2017291 | I-BET151 (16)
TypeSmall organic molecule
Emp. Form.C23H21N5O3
Mol. Mass.415.4445
SMILESCOc1cc2c3n([C@H](C)c4ccccn4)c(=O)[nH]c3cnc2cc1-c1c(C)noc1C