Reaction Details
TargetInorganic pyrophosphatase
LigandBDBM205475
Substrate/Competitorn/a
Meas. Tech.Colorimetric Malachite Green Assay
pH7.5±n/a
Temperature298.15±n/a K
IC50 4.18e+5± 2.4e+4 nM
Commentsextracted
Citation Pang, AHGarzan, ALarsen, MJMcQuade, TJGarneau-Tsodikova, STsodikov, OV Discovery of Allosteric and Selective Inhibitors of Inorganic Pyrophosphatase from Mycobacterium tuberculosis. ACS Chem Biol11:3084-3092 (2016) 
 
Inorganic pyrophosphatase
Name:Inorganic pyrophosphatase
Type:Protein
Mol. Mass.:32294.13
Organism:Saccharomyces cerevisiae (Yeast)
Description:P00817
Residue:287
BDBM205475
NameBDBM205475
Synonyms:PPiase inhibitor, 19
TypeSmall organic molecule
Emp. Form.C27H44N6
Mol. Mass.452.6785
SMILESCCCCN(CCCC)c1nc(nc(n1)-c1cccn1C1CCCCC1)N1CCCCCC1