Reaction Details
TargetExtracellular calcium-sensing receptor
LigandBDBM205499
Substrate/Competitorn/a
Meas. Tech.Agonistic Activity Assay
pH7.2±n/a
Temperature310.15±n/a K
EC50 40±n/a nM
Commentsextracted
Citation Sugiki, MOkamatsu, TYano, TTaniguchi, S Alkylamine derivative US Patent US9253997 Publication Date 2/9/2016
 
Extracellular calcium-sensing receptor
Name:Extracellular calcium-sensing receptor
Type:Protein
Mol. Mass.:120663.13
Organism:Homo sapiens (Human)
Description:P41180
Residue:1078
BDBM205499
NameBDBM205499
Synonyms:US9253997, 4
TypeSmall organic molecule
Emp. Form.C10H12N2O6S2
Mol. Mass.320.342
SMILESN[C@@H](CSC(=O)Nc1cccc(c1)S(O)(=O)=O)C(O)=O