Reaction Details
TargetExtracellular calcium-sensing receptor
LigandBDBM205502
Substrate/Competitorn/a
Meas. Tech.Agonistic Activity Assay
pH7.2±n/a
Temperature310.15±n/a K
EC50 3±n/a nM
Commentsextracted
Citation Sugiki, MOkamatsu, TYano, TTaniguchi, S Alkylamine derivative US Patent US9253997 Publication Date 2/9/2016
 
Extracellular calcium-sensing receptor
Name:Extracellular calcium-sensing receptor
Type:Protein
Mol. Mass.:120663.13
Organism:Homo sapiens (Human)
Description:P41180
Residue:1078
BDBM205502
NameBDBM205502
Synonyms:US9253997, 14
TypeSmall organic molecule
Emp. Form.C11H14ClN3O6S
Mol. Mass.351.763
SMILESCc1c(Cl)cc(cc1NC(=O)NCC(N)C(O)=O)S(O)(=O)=O