Reaction Details
TargetExtracellular calcium-sensing receptor
LigandBDBM205511
Substrate/Competitorn/a
Meas. Tech.Agonistic Activity Assay
pH7.2±n/a
Temperature310.15±n/a K
EC50 4±n/a nM
Commentsextracted
Citation Sugiki, MOkamatsu, TYano, TTaniguchi, S Alkylamine derivative US Patent US9253997 Publication Date 2/9/2016
 
Extracellular calcium-sensing receptor
Name:Extracellular calcium-sensing receptor
Type:Protein
Mol. Mass.:120663.13
Organism:Homo sapiens (Human)
Description:P41180
Residue:1078
BDBM205511
NameBDBM205511
Synonyms:US9253997, 47
TypeSmall organic molecule
Emp. Form.C11H14ClN3O5S2
Mol. Mass.367.829
SMILESCc1c(Cl)cc(cc1NC(=S)NC[C@H](N)C(O)=O)S(O)(=O)=O