Reaction Details
TargetProstaglandin D2 receptor 2
LigandBDBM205626
Substrate/Competitorn/a
Meas. Tech.Radioligand Displacement Assay
pH7±n/a
Temperature298.15±n/a K
IC50 0.22±n/a nM
Commentsextracted
Citation Aissaoui, HBoss, CRichard-Bildstein, SSiegrist, R Heterocyclyl derivatives and their use as prostaglandin D2 receptor modulators US Patent US9255090 Publication Date 2/9/2016
 
Prostaglandin D2 receptor 2
Name:Prostaglandin D2 receptor 2
Type:Enzyme
Mol. Mass.:43295.45
Organism:Homo sapiens (Human)
Description:Q9Y5Y4
Residue:395
BDBM205626
NameBDBM205626
Synonyms:US9255090, 95
TypeSmall organic molecule
Emp. Form.C29H25F4NO4
Mol. Mass.527.5067
SMILESCOc1ccc(CC(O)=O)cc1-c1ccc(F)c2CCN(Cc12)C(=O)C1CC1c1ccccc1C(F)(F)F