Reaction Details
TargetDelta-type opioid receptor
LigandBDBM50015003
Substrate/Competitorn/a
Meas. Tech.Ligand Binding Assays
pH7.4±n/a
Temperature298.15±n/a K
Ki 1.91±n/a nM
Commentsextracted
Citation Lewis, JHusbands, S Orvinol and thevinol derivatives useful in the treatment of depression US Patent US9259422 Publication Date 2/16/2016
 
Delta-type opioid receptor
Name:Delta-type opioid receptor
Type:G Protein-Coupled Receptor (GPCR)
Mol. Mass.:40465.04
Organism:Rattus norvegicus (rat)
Description:Competition binding assays were using CHO-K1 cell membranes expressing the opioid receptor.
Residue:372
BDBM50015003
NameBDBM50015003
Synonyms:CHEMBL3262089 US9480684, 7a, R = Ph- BU127
TypeSmall organic molecule
Emp. Form.C31H37NO4
Mol. Mass.487.6298
SMILES[H][C@@]12Oc3c4c(C[C@@]5([H])N(CC6CC6)CC[C@@]14[C@@]51CC[C@@]2(OC)[C@]([H])(C1)[C@](C)(O)c1ccccc1)ccc3O