Reaction Details
TargetTyrosine-protein kinase BTK
LigandBDBM206364
Substrate/Competitorn/a
Meas. Tech.Biochemical Btk Assay
pH7.5±n/a
Ki 2.16±n/a nM
Commentsextracted
Citation Crawford, JJWei, BYoung, WB Heteroaryl pyridone and aza-pyridone compounds with electrophilic functionality US Patent US9260415 Publication Date 2/16/2016
 
Tyrosine-protein kinase BTK
Name:Tyrosine-protein kinase BTK
Type:Enzyme
Mol. Mass.:76289.95
Organism:Homo sapiens (Human)
Description:Q06187
Residue:659
BDBM206364
NameBDBM206364
Synonyms:US9260415, 115
TypeSmall organic molecule
Emp. Form.C36H36FN7O4S
Mol. Mass.681.779
SMILESCn1cc(cc(Nc2cccc(n2)N2CCC[C@@H](C2)NC(=O)C=C)c1=O)-c1cc(F)cc(c1CO)-n1ncc2c3CCCCc3sc2c1=O