Reaction Details
TargetBeta-2 adrenergic receptor
LigandBDBM50213119
Substrate/Competitorn/a
Meas. Tech.Beta2-AR Binding Assay
pH7.7±n/a
Kd 10471±n/a nM
Commentsextracted
Citation Wainer, IWBernier, MToll, LRJimenez, LA Use of fenoterol and fenoterol analogues in the treatment of glioblastomas and astrocytomas US Patent US9492405 Publication Date 11/15/2016
 
Beta-2 adrenergic receptor
Name:Beta-2 adrenergic receptor
Type:n/a
Mol. Mass.:46461.69
Organism:Homo sapiens (Human)
Description:P07550
Residue:413
BDBM50213119
NameBDBM50213119
Synonyms:(R)-(-)-5-(1-hydroxy-2-phenethylaminoethyl)-1,3-benzenediol US10617654, Compound (R)-7 US9492405, (R)-7 | US9492405, 25
TypeSmall organic molecule
Emp. Form.C16H19NO3
Mol. Mass.273.327
SMILESO[C@@H](CNCCc1ccccc1)c1cc(O)cc(O)c1