Reaction Details
TargetBeta-2 adrenergic receptor
LigandBDBM50213115
Substrate/Competitorn/a
Meas. Tech.Mitogenesis inhibition method
Temperature310.15±n/a K
IC50 1.57±0.34 nM
Commentsextracted
Citation Wainer, IWBernier, MToll, LRJimenez, LA Use of fenoterol and fenoterol analogues in the treatment of glioblastomas and astrocytomas US Patent US9492405 Publication Date 11/15/2016
 
Beta-2 adrenergic receptor
Name:Beta-2 adrenergic receptor
Type:n/a
Mol. Mass.:46461.69
Organism:Homo sapiens (Human)
Description:P07550
Residue:413
BDBM50213115
NameBDBM50213115
Synonyms:(R,R)-(-)-5-{1-hydroxy-2-[1-methyl-2-(1-naphthyl)ethylamino]ethyl}-1,3-benzenediol US10617654, Compound (R,R)-5 US9492405, 39
TypeSmall organic molecule
Emp. Form.C21H23NO3
Mol. Mass.337.4122
SMILESC[C@H](Cc1cccc2ccccc12)NC[C@H](O)c1cc(O)cc(O)c1