Reaction Details
TargetBeta-2 adrenergic receptor
LigandBDBM50348427
Substrate/Competitorn/a
Meas. Tech.Mitogenesis inhibition method
Temperature310.15±n/a K
IC50 17.88±4.56 nM
Commentsextracted
Citation Wainer, IWBernier, MToll, LRJimenez, LA Use of fenoterol and fenoterol analogues in the treatment of glioblastomas and astrocytomas US Patent US9492405 Publication Date 11/15/2016
 
Beta-2 adrenergic receptor
Name:Beta-2 adrenergic receptor
Type:n/a
Mol. Mass.:46461.69
Organism:Homo sapiens (Human)
Description:P07550
Residue:413
BDBM50348427
NameBDBM50348427
Synonyms:CHEMBL1800960 | US9492405, 49
TypeSmall organic molecule
Emp. Form.C18H23NO4
Mol. Mass.317.3795
SMILESCC[C@@H](Cc1ccc(O)cc1)NC[C@H](O)c1cc(O)cc(O)c1