Reaction Details
TargetDisintegrin and metalloproteinase domain-containing protein 9
LigandBDBM50181008
Substrate/Competitorn/a
Meas. Tech.Inhibition Assay
IC50 85±n/a nM
Citation Clary, LPascal, J 4-alkoxy-N-(2-hydroxycarbamoyl-2-piperidinyl-ethyl)-benzamide compounds as selective TACE-inhibitors for the treatment of inflammatory diseases US Patent US9266848 Publication Date 2/23/2016
 
Disintegrin and metalloproteinase domain-containing protein 9
Name:Disintegrin and metalloproteinase domain-containing protein 9
Type:Enzyme
Mol. Mass.:90567.68
Organism:Homo sapiens (Human)
Description:Q13443
Residue:819
BDBM50181008
NameBDBM50181008
Synonyms:(S)-N-hydroxy-4-(4-(4-hydroxybut-2-ynyloxy)phenylsulfonyl)-2,2-dimethylthiomorpholine-3-carboxamide TMI-05 US9365529, Apratastat
TypeSmall organic molecule
Emp. Form.C17H22N2O6S2
Mol. Mass.414.496
SMILESCC1(C)SCCN([C@H]1C(=O)NO)S(=O)(=O)c1ccc(OCC#CCO)cc1