Reaction Details
TargetAcyl-protein thioesterase 1 [L176M]
LigandBDBM207991
Substrate/Competitorn/a
Meas. Tech.Steady-State Kinetic Assays
pH6.5±n/a
Ki 340±40 nM
Commentsextracted
Citation Won, SJDavda, DLabby, KJHwang, SYPricer, RMajmudar, JDArmacost, KARodriguez, LARodriguez, CLChong, FSTorossian, KAPalakurthi, JHur, ESMeagher, JLBrooks, CLStuckey, JAMartin, BR Molecular Mechanism for Isoform-Selective Inhibition of Acyl Protein Thioesterases 1 and 2 (APT1 and APT2). ACS Chem Biol11:3374-3382 (2016) 
 
Acyl-protein thioesterase 1 [L176M]
Name:Acyl-protein thioesterase 1 [L176M]
Type:Protein
Mol. Mass.:24688.37
Organism:Homo sapiens (Human)
Description:Human APT1 with L176M mutation
Residue:230
BDBM207991
NameBDBM207991
Synonyms:ML348
TypeSmall organic molecule
Emp. Form.C18H17ClF3N3O3
Mol. Mass.415.794
SMILESFC(F)(F)c1ccc(Cl)c(NC(=O)CN2CCN(CC2)C(=O)c2ccco2)c1