Reaction Details
TargetKappa-type opioid receptor
LigandBDBM208989
Substrate/Competitorn/a
Meas. Tech.Scintillation Proximity Assay (SPA)
Temperature298.15±n/a K
Ki 1253.71±n/a nM
Commentsextracted
Citation Riggs-Sauthier, JDeng, BRiley, TA Oligomer-opioid agonist conjugates US Patent US9233167 Publication Date 1/12/2016
 
Kappa-type opioid receptor
Name:Kappa-type opioid receptor
Type:G Protein-Coupled Receptor (GPCR)
Mol. Mass.:42648.76
Organism:Homo sapiens (Human)
Description:P41145
Residue:380
BDBM208989
NameBDBM208989
Synonyms:US9233167, a-6-mPEG9-O-Morphine
TypeSmall organic molecule
Emp. Form.C36H59NO13
Mol. Mass.713.8526
[C@H]1CC[C@@]2(O)C3Cc4ccc(O)c5O[C@@H]1[C@]2(CCN3C)c45