Reaction Details
TargetDelta-type opioid receptor
LigandBDBM209009
Substrate/Competitorn/a
Meas. Tech.Binding of PEG-Nalbuphine assays
Ki 167.5±0.0 nM
Citation Riggs-Sauthier, JDeng, BRiley, TA Oligomer-opioid agonist conjugates US Patent US9233167 Publication Date 1/12/2016
 
Delta-type opioid receptor
Name:Delta-type opioid receptor
Type:G Protein-Coupled Receptor (GPCR)
Mol. Mass.:40382.98
Organism:Homo sapiens (Human)
Description:Competition binding assays were carried out using membrane preparations from transfected HN9.10 cells that constitutively expressed the delta opioid receptor.
Residue:372
BDBM209009
NameBDBM209009
Synonyms:US9233167, 6-O-mPEG8-Nalbuphine
TypeSmall organic molecule
Emp. Form.C38H61NO12
Mol. Mass.723.8904
[C@H]1CC[C@@]2(O)[C@H]3Cc4ccc(O)c5OC1[C@]2(CCN3CC1CCC1)c45