Reaction Details
TargetVascular endothelial growth factor receptor 2
LigandBDBM208444
Substrate/Competitorn/a
Meas. Tech.VEGFR2 Kinase Assay
pH7.4±n/a
Temperature303.15±n/a K
IC50 2±n/a nM
Commentsextracted
Citation Boral, SWang, SMalone, TWurster, JShen, JRobinson, M Substituted dialkyl(oxido)-lambda4-sulfanylidene nicotinamide derivatives as kinase inhibitors US Patent US9266869 Publication Date 2/23/2016
 
Vascular endothelial growth factor receptor 2
Name:Vascular endothelial growth factor receptor 2
Type:Receptor Tyrosine Kinase
Mol. Mass.:151510.97
Organism:Homo sapiens (Human)
Description:P35968
Residue:1356
BDBM208444
NameBDBM208444
Synonyms:US9266869, 2
TypeSmall organic molecule
Emp. Form.C22H19N3O4S
Mol. Mass.421.469
SMILESCc1ccoc1C(=O)Nc1cccc(c1)C#Cc1cncc(c1)C(=O)N=S(C)(C)=O