Reaction Details
TargetVascular endothelial growth factor receptor 2
LigandBDBM208447
Substrate/Competitorn/a
Meas. Tech.VEGFR2 Kinase Assay
pH7.4±n/a
Temperature303.15±n/a K
IC50 2±n/a nM
Commentsextracted
Citation Boral, SWang, SMalone, TWurster, JShen, JRobinson, M Substituted dialkyl(oxido)-lambda4-sulfanylidene nicotinamide derivatives as kinase inhibitors US Patent US9266869 Publication Date 2/23/2016
 
Vascular endothelial growth factor receptor 2
Name:Vascular endothelial growth factor receptor 2
Type:Receptor Tyrosine Kinase
Mol. Mass.:151510.97
Organism:Homo sapiens (Human)
Description:P35968
Residue:1356
BDBM208447
NameBDBM208447
Synonyms:US9266869, 5
TypeSmall organic molecule
Emp. Form.C23H19ClN4O3S
Mol. Mass.466.94
SMILESCS(C)(=O)=NC(=O)c1cnc(N)c(c1)C#Cc1cccc(NC(=O)c2ccc(Cl)cc2)c1