Reaction Details
TargetVascular endothelial growth factor receptor 2
LigandBDBM208450
Substrate/Competitorn/a
Meas. Tech.VEGFR2 Kinase Assay
pH7.4±n/a
Temperature303.15±n/a K
IC50 3±n/a nM
Commentsextracted
Citation Boral, SWang, SMalone, TWurster, JShen, JRobinson, M Substituted dialkyl(oxido)-lambda4-sulfanylidene nicotinamide derivatives as kinase inhibitors US Patent US9266869 Publication Date 2/23/2016
 
Vascular endothelial growth factor receptor 2
Name:Vascular endothelial growth factor receptor 2
Type:Receptor Tyrosine Kinase
Mol. Mass.:151510.97
Organism:Homo sapiens (Human)
Description:P35968
Residue:1356
BDBM208450
NameBDBM208450
Synonyms:US9266869, 8
TypeSmall organic molecule
Emp. Form.C24H21FN4O3S
Mol. Mass.464.512
SMILESCc1ccc(F)c(NC(=O)Nc2cccc(c2)C#Cc2cncc(c2)C(=O)N=S(C)(C)=O)c1