Reaction Details
TargetVascular endothelial growth factor receptor 2
LigandBDBM208454
Substrate/Competitorn/a
Meas. Tech.VEGFR2 Kinase Assay
pH7.4±n/a
Temperature303.15±n/a K
IC50 3±n/a nM
Commentsextracted
Citation Boral, SWang, SMalone, TWurster, JShen, JRobinson, M Substituted dialkyl(oxido)-lambda4-sulfanylidene nicotinamide derivatives as kinase inhibitors US Patent US9266869 Publication Date 2/23/2016
 
Vascular endothelial growth factor receptor 2
Name:Vascular endothelial growth factor receptor 2
Type:Receptor Tyrosine Kinase
Mol. Mass.:151510.97
Organism:Homo sapiens (Human)
Description:P35968
Residue:1356
BDBM208454
NameBDBM208454
Synonyms:US9266869, 12
TypeSmall organic molecule
Emp. Form.C27H27N5O6S
Mol. Mass.549.598
SMILESCc1ccoc1C(=O)Nc1cccc(c1)C#Cc1cc(cnc1N)C(=O)N=S(C)(=O)CC(=O)N1CC[C@H](O)C1