Reaction Details
TargetVascular endothelial growth factor receptor 2
LigandBDBM208474
Substrate/Competitorn/a
Meas. Tech.VEGFR2 Cellular Assay
Temperature310.15±n/a K
IC50 1±n/a nM
Commentsextracted
Citation Boral, SWang, SMalone, TWurster, JShen, JRobinson, M Substituted dialkyl(oxido)-lambda4-sulfanylidene nicotinamide derivatives as kinase inhibitors US Patent US9266869 Publication Date 2/23/2016
 
Vascular endothelial growth factor receptor 2
Name:Vascular endothelial growth factor receptor 2
Type:Receptor Tyrosine Kinase
Mol. Mass.:151510.97
Organism:Homo sapiens (Human)
Description:P35968
Residue:1356
BDBM208474
NameBDBM208474
Synonyms:US9266869, 32
TypeSmall organic molecule
Emp. Form.C27H28N4O6S
Mol. Mass.536.599
SMILESCOC(=O)CCCC[S@](C)(=O)=NC(=O)c1cnc(N)c(c1)C#Cc1cccc(NC(=O)c2occc2C)c1