Reaction Details
TargetPlatelet-derived growth factor receptor beta
LigandBDBM208447
Substrate/Competitorn/a
Meas. Tech.PDGFRbeta Kinase Assay
pH7.4±n/a
Temperature303.15±n/a K
IC50 22±n/a nM
Commentsextracted
Citation Boral, SWang, SMalone, TWurster, JShen, JRobinson, M Substituted dialkyl(oxido)-lambda4-sulfanylidene nicotinamide derivatives as kinase inhibitors US Patent US9266869 Publication Date 2/23/2016
 
Platelet-derived growth factor receptor beta
Name:Platelet-derived growth factor receptor beta
Type:Enzyme
Mol. Mass.:123922.25
Organism:Homo sapiens (Human)
Description:P09619
Residue:1106
BDBM208447
NameBDBM208447
Synonyms:US9266869, 5
TypeSmall organic molecule
Emp. Form.C23H19ClN4O3S
Mol. Mass.466.94
SMILESCS(C)(=O)=NC(=O)c1cnc(N)c(c1)C#Cc1cccc(NC(=O)c2ccc(Cl)cc2)c1