Reaction Details
TargetC-X-C chemokine receptor type 3/Guanine nucleotide-binding protein subunit alpha-15
LigandBDBM208702
Substrate/Competitorn/a
Meas. Tech.FLIPR Assay
pH7.4±n/a
Temperature310.15±n/a K
IC50 0.3±n/a nM
Commentsextracted
Citation Caroff, EKeller, MKimmerlin, TMeyer, E 4-(benzoimidazol-2-yl)-thiazole compounds and related aza derivatives US Patent US9266876 Publication Date 2/23/2016
 
C-X-C chemokine receptor type 3/Guanine nucleotide-binding protein subunit alpha-15
Name:C-X-C chemokine receptor type 3/Guanine nucleotide-binding protein subunit alpha-15
Synonyms:CXCR3A / G protein (Galpha(16))
Type:Protein
Mol. Mass.:n/a
Description:n/a
Components:This complex has 2 components.
Component 1
Name:C-X-C chemokine receptor type 3
Type:Enzyme Catalytic Domain
Mol. Mass.:40665.65
Organism:Homo sapiens (Human)
Description:n/a
Residue:368
Component 2
Name:Guanine nucleotide-binding protein subunit alpha-15
Synonyms:G protein alpha 16 G-protein subunit alpha-16 (G alpha-16) GNA15_HUMAN Guanine nucleotide-binding protein subunit alpha-15 [Y147C]
Type:Protein
Mol. Mass.:43577.62
Organism:Homo sapiens (Human)
Description:P30679
Residue:374
BDBM208702
NameBDBM208702
Synonyms:US9266876, 169
TypeSmall organic molecule
Emp. Form.C23H20F3N9OS
Mol. Mass.527.525
SMILESC[C@@H]1CN(CCN1C(=O)Cn1cnc2cccnc12)c1sc(nc1-c1nc2cccnc2[nH]1)C(F)(F)F