Reaction Details
TargetBcl-2-like protein 1
LigandBDBM209202
Substrate/Competitorn/a
Meas. Tech.Time Resolved-Fluorescence Resonance Energy Transfer (TR-FRET) Assay
Temperature298.15±n/a K
Ki<0.1±n/a nM
Commentsextracted
Citation Wang, LDoherty, GWang, XTao, ZBruncko, MKunzer, ARWendt, MDSong, XFrey, RHansen, TMSullivan, GMJudd, ASouers, A Apoptosis-inducing agents for the treatment of cancer and immune and autoimmune diseases US Patent US9266877 Publication Date 2/23/2016
 
Bcl-2-like protein 1
Name:Bcl-2-like protein 1
Type:Mitochondrion membrane; Single-pass membrane protein
Mol. Mass.:26039.60
Organism:Homo sapiens (Human)
Description:n/a
Residue:233
BDBM209202
NameBDBM209202
Synonyms:US9266877, 148
TypeSmall organic molecule
Emp. Form.C39H45N7O5S2
Mol. Mass.755.949
SMILESCOCCC1(Cn2ncc(c2C)-c2ccc(nc2C(=O)NS(C)(=O)=O)N2CCc3cccc(C(=O)Nc4nc5ccccc5s4)c3C2)CCCCCC1