Reaction Details
TargetBcl-2-like protein 1
LigandBDBM209232
Substrate/Competitorn/a
Meas. Tech.Time Resolved-Fluorescence Resonance Energy Transfer (TR-FRET) Assay
Temperature298.15±n/a K
Ki<0.1±n/a nM
Commentsextracted
Citation Wang, LDoherty, GWang, XTao, ZBruncko, MKunzer, ARWendt, MDSong, XFrey, RHansen, TMSullivan, GMJudd, ASouers, A Apoptosis-inducing agents for the treatment of cancer and immune and autoimmune diseases US Patent US9266877 Publication Date 2/23/2016
 
Bcl-2-like protein 1
Name:Bcl-2-like protein 1
Type:Mitochondrion membrane; Single-pass membrane protein
Mol. Mass.:26039.60
Organism:Homo sapiens (Human)
Description:n/a
Residue:233
BDBM209232
NameBDBM209232
Synonyms:US9266877, 178
TypeSmall organic molecule
Emp. Form.C39H44N6O6S2
Mol. Mass.756.933
SMILESCc1c(cnn1CC1(CCCC(C)(C)C1)OCCS(C)(=O)=O)-c1ccc(nc1C(O)=O)N1CCc2cccc(C(=O)Nc3nc4ccccc4s3)c2C1