Reaction Details
TargetBcl-2-like protein 1
LigandBDBM209065
Substrate/Competitorn/a
Meas. Tech.FL5.12 Cellular Assay
EC50>1000±n/a nM
Citation Wang, LDoherty, GWang, XTao, ZBruncko, MKunzer, ARWendt, MDSong, XFrey, RHansen, TMSullivan, GMJudd, ASouers, A Apoptosis-inducing agents for the treatment of cancer and immune and autoimmune diseases US Patent US9266877 Publication Date 2/23/2016
 
Bcl-2-like protein 1
Name:Bcl-2-like protein 1
Type:Protein
Mol. Mass.:26122.63
Organism:Mus musculus (Mouse)
Description:Q64373
Residue:233
BDBM209065
NameBDBM209065
Synonyms:US9266877, 11
TypeSmall organic molecule
Emp. Form.C34H28N6O4S
Mol. Mass.616.689
SMILESCOc1ccc2nc(NC(=O)c3cccc4CCN(Cc34)c3ccc(-c4cnn(Cc5ccccc5)c4)c(n3)C(O)=O)sc2c1