Reaction Details
TargetBcl-2-like protein 1
LigandBDBM209082
Substrate/Competitorn/a
Meas. Tech.FL5.12 Cellular Assay
EC50>1000±n/a nM
Citation Wang, LDoherty, GWang, XTao, ZBruncko, MKunzer, ARWendt, MDSong, XFrey, RHansen, TMSullivan, GMJudd, ASouers, A Apoptosis-inducing agents for the treatment of cancer and immune and autoimmune diseases US Patent US9266877 Publication Date 2/23/2016
 
Bcl-2-like protein 1
Name:Bcl-2-like protein 1
Type:Protein
Mol. Mass.:26122.63
Organism:Mus musculus (Mouse)
Description:Q64373
Residue:233
BDBM209082
NameBDBM209082
Synonyms:US9266877, 28
TypeSmall organic molecule
Emp. Form.C37H28N6O3S
Mol. Mass.636.722
SMILESOC(=O)c1nc(ccc1-c1cnn(Cc2ccc3ccccc3c2)c1)N1CCc2cccc(C(=O)Nc3nc4ccccc4s3)c2C1