Reaction Details
TargetBcl-2-like protein 1
LigandBDBM209219
Substrate/Competitorn/a
Meas. Tech.FL5.12 Cellular Assay
EC50 9±n/a nM
Citation Wang, LDoherty, GWang, XTao, ZBruncko, MKunzer, ARWendt, MDSong, XFrey, RHansen, TMSullivan, GMJudd, ASouers, A Apoptosis-inducing agents for the treatment of cancer and immune and autoimmune diseases US Patent US9266877 Publication Date 2/23/2016
 
Bcl-2-like protein 1
Name:Bcl-2-like protein 1
Type:Protein
Mol. Mass.:26122.63
Organism:Mus musculus (Mouse)
Description:Q64373
Residue:233
BDBM209219
NameBDBM209219
Synonyms:US9266877, 165
TypeSmall organic molecule
Emp. Form.C35H36N6O4S
Mol. Mass.636.763
SMILESCOC1(Cn2ncc(c2C)-c2ccc(nc2C(O)=O)N2CCc3cccc(C(=O)Nc4nc5ccccc5s4)c3C2)CCCCC1