Reaction Details
TargetDual specificity protein kinase TTK
LigandBDBM209397
Substrate/Competitorn/a
Meas. Tech.LanthaScreen Activity Assay
Temperature298.15±n/a K
IC50 342.2±n/a nM
Commentsextracted
Citation Gray, NSDeng, XKwiatkowski, NP Pyrimido-diazepinone kinase scaffold compounds and methods of treating disorders US Patent US9266890 Publication Date 2/23/2016
 
Dual specificity protein kinase TTK
Name:Dual specificity protein kinase TTK
Type:Protein
Mol. Mass.:97086.79
Organism:Homo sapiens (Human)
Description:P33981
Residue:857
BDBM209397
NameBDBM209397
Synonyms:US9266890, I-6
TypeSmall organic molecule
Emp. Form.C25H34N6O3
Mol. Mass.466.5759
SMILESCOc1cc(ccc1Nc1ncc2N(C)C(=O)CCN(C3CCCC3)c2n1)N1CCC(O)CC1