Reaction Details
TargetSerine/threonine-protein kinase PLK1
LigandBDBM209414
Substrate/Competitorn/a
Meas. Tech.In Vitro Plk1Binding Assay
Kd 18±n/a nM
Citation Gray, NSDeng, XKwiatkowski, NP Pyrimido-diazepinone kinase scaffold compounds and methods of treating disorders US Patent US9266890 Publication Date 2/23/2016
 
Serine/threonine-protein kinase PLK1
Name:Serine/threonine-protein kinase PLK1
Type:Serine/threonine-protein kinase
Mol. Mass.:68277.16
Organism:Homo sapiens (Human)
Description:P53350
Residue:603
BDBM209414
NameBDBM209414
Synonyms:US9266890, I-24
TypeSmall organic molecule
Emp. Form.C23H28N6O2
Mol. Mass.420.5074
SMILESCN1c2cnc(Nc3ccc(cc3)C(N)=O)nc2N(C2CCCC2)[C@@H]2CCC[C@@H]2C1=O